OSCAT-2
type: Concept
change note: 2020-05-20 12:34:18.0 [sritz] insert AltLabel (id: null category: primary text: OceanSat-2 Scatterometer language code: en); insert Definition (id: null text: The OSCAT-2 is used to determine ocean surface-level wind vectors through the estimation of radar backscatter. It is the instrument onboard SCATSat-1, developed by the Indian Space Research Organisation (ISRO) Satellite Centre, Ahmedabad, India. OSCAT-2 is similar to OSCAT flown onboard OceanSat-2. However, many improvements both in hardware as well as for the onboard signal processor and control software are being implemented, based on the OSCAT experience. The instrument is a pencil beam wind scatterometer operating at Ku-band of 13.515 GHz. language code: en);
change note: 2020-05-20 13:13:32.0 [sritz] insert WeightedRelation (id: null related concept uuid: 3abc7c20-963c-49ed-bb73-8fcacdce9d8c relationship type: null relationship value: null generated by: null);
change note: 2020-05-20 13:15:07.0 [sritz] update WeightedRelation (Platform-Instrument); update WeightedRelation (1.0);
change note: 2020-05-20 12:33:17.0 [sritz] Insert Concept add broader relation (OSCAT-2 [3abc7c20-963c-49ed-bb73-8fcacdce9d8c,560151] - Scatterometers [563f30c8-43f8-48be-b649-4b548f877fa4,544135]);
change note: 2020-05-20 13:14:25.0 [sritz] delete WeightedRelation (null); insert WeightedRelation (id: null related concept uuid: fbfed562-4772-48fe-b2bb-7ebced3a7c9f relationship type: null relationship value: null generated by: null);
definition: The OSCAT-2 is used to determine ocean surface-level wind vectors through the estimation of radar backscatter. It is the instrument onboard SCATSat-1, developed by the Indian Space Research Organisation (ISRO) Satellite Centre, Ahmedabad, India. OSCAT-2 is similar to OSCAT flown onboard OceanSat-2. However, many improvements both in hardware as well as for the onboard signal processor and control software are being implemented, based on the OSCAT experience. The instrument is a pencil beam wind scatterometer operating at Ku-band of 13.515 GHz.
in scheme: instruments

Scatterometers
type: Concept