IODP
type: Concept
change note: 2015-11-06 08:59:30.0 [epneff] new keyword added for NOAA insert AltLabel (id: null text: International Ocean Discovery Program language code: en); insert Definition (id: null text: The International Ocean Discovery Program (IODP) is an international marine research collaboration between 26 nations dedicated to advancing scientific understanding of Earth by sampling, instrumenting and monitoring subseafloor environments using specialized ocean drilling platforms staffed by multidisciplinary research scientists. language code: en);
change note: 2015-11-06 08:58:23.0 [epneff] Insert Concept add broader relation (IODP [3ad9105d-cbae-46c6-94ab-398ed5eedcd8,158479] - G - I [af0968ce-ffe3-44a0-86de-2ec9b9a8fa5d,149601]);
definition: The International Ocean Discovery Program (IODP) is an international marine research collaboration between 26 nations dedicated to advancing scientific understanding of Earth by sampling, instrumenting and monitoring subseafloor environments using specialized ocean drilling platforms staffed by multidisciplinary research scientists.
in scheme: projects

G - I
type: Concept