Spectrometers
type: Concept

MMRS
type: Concept
definition: The MMRS, Multispectral Medium Resolution Scanner is a five channel camera with detection capability in VIS, NIR and SWIR ranges. On-ground pixel size is 175 m and spectral bands were selected to fit land and coastal study requirements. Additional information available at "http://www.invap.net/space/mmrs/intro-e.html" [Summary provided by INVAP]
in scheme: instruments