UMICH/ENG/CSSE
type: Concept
change note: 2019-11-08 14:37:09.0 [tstevens] insert AltLabel (id: null category: primary text: Climate and Space Sciences and Engineering, College of Engineering, University of Michigan language code: en); insert Definition (id: null text: The Climate and Space Sciences and Engineering Department combines scientific and technological excellence and leadership to explore the Sun, the Earth, our solar system, and the space beyond. We use observations, modeling, and theory to discover and explain phenomena that define our place in the universe, and address the pressing problems associated with global change. As part of the University of Michigan College of Engineering, we inspire our students to develop as intellectually curious, engaged citizens and use our knowledge to inform the public, stakeholders, and policy makers. language code: en); insert Resource (id: null type: provider url: https://clasp.engin.umich.edu/);
change note: 2019-11-08 14:33:41.0 [tstevens] Insert Concept add broader relation (UMICH/ENG/CSSE [3b71fb47-0d05-4a25-ae63-6ad08346cedd,423233] - ACADEMIC [7700280b-68ee-4644-bf5e-84e7a6adf897,397665]);
definition: The Climate and Space Sciences and Engineering Department combines scientific and technological excellence and leadership to explore the Sun, the Earth, our solar system, and the space beyond. We use observations, modeling, and theory to discover and explain phenomena that define our place in the universe, and address the pressing problems associated with global change. As part of the University of Michigan College of Engineering, we inspire our students to develop as intellectually curious, engaged citizens and use our knowledge to inform the public, stakeholders, and policy makers.
in scheme: providers

ACADEMIC
type: Concept