CA/NFLD/INTRD
type: Concept
definition: The Department of Innovation, Trade and Rural Development (INTRD) was created in 2004 to reflect the enhanced emphasis placed on the innovation aspect of the provincial economic agenda. It is the lead agency for economic development in the province and in each of its regions. Summary Provided by: http://www.intrd.gov.nl.ca/intrd/aboutdept.htm
in scheme: providers

CANADA
type: Concept