CUMULUS CONGESTUS
type: Concept
change note: 2013-02-14 09:51:32.0 [mpmorahan] Insert Concept add broader relation (CUMULUS CONGESTUS [3bafe2e0-c1a7-4bee-a02e-ac66964b4d7f,82223] - CUMULUS [e1dff4d5-2e5b-46e7-9804-9de29fdb36d9,82215]);
change note: 2013-03-21 13:21:59.0 [mpmorahan] insert Definition (id: null text: A strongly sprouting cumulus species with generally sharp outlines and, sometimes, with a great vertical development; it is characterized by its cauliflower or tower aspect, of large size. Mainly in the Tropics, cumulus congestus may produce abundant precipitation. It may also occur in the form of very high towers, the tops of which are formed of kinds of cloudy puffs that, detaching themselves successively from the main portion of the cloud, are carried away by the wind, then disappear more or less rapidly, sometimes producing virga. Cumulus congestus is the result of the development of cumulus mediocris and, sometimes, of that of altocumulus castellanus or stratocumulus castellanus. Cumulus congestus often transforms into cumulonimbus; this transformation is revealed by the smooth, fibrous, or striated aspect assumed by its upper portion. The species congestus is unique to the genus cumulus. language code: en);
change note: 2013-02-14 09:53:54.0 [mpmorahan] Insert Concept add narrower relation (CUMULUS CONGESTUS [3bafe2e0-c1a7-4bee-a02e-ac66964b4d7f,82223] - TOWERING CUMULUS [79668331-c50d-49da-aea6-83c94545f9e3,82225]);
definition: A strongly sprouting cumulus species with generally sharp outlines and, sometimes, with a great vertical development; it is characterized by its cauliflower or tower aspect, of large size. Mainly in the Tropics, cumulus congestus may produce abundant precipitation. It may also occur in the form of very high towers, the tops of which are formed of kinds of cloudy puffs that, detaching themselves successively from the main portion of the cloud, are carried away by the wind, then disappear more or less rapidly, sometimes producing virga. Cumulus congestus is the result of the development of cumulus mediocris and, sometimes, of that of altocumulus castellanus or stratocumulus castellanus. Cumulus congestus often transforms into cumulonimbus; this transformation is revealed by the smooth, fibrous, or striated aspect assumed by its upper portion. The species congestus is unique to the genus cumulus.
in scheme: sciencekeywords

TOWERING CUMULUS
type: Concept

CUMULUS
type: Concept