USDA/FS/ENG/RSAC
type: Concept
definition: The USDA Forest Service's Remote Sensing Applications Center (RSAC) is in Salt Lake City, Utah, co-located with the agency's Geospatial Service and Technology Center. Guided by national steering committees and field sponsors, the two centers together provide national assistance to agency field units in applying the most advanced geospatial technology toward improved monitoring and mapping of natural resources. RSAC's principal goal is to develop and implement less costly ways for the Forest Service to obtain needed forest resource information. Website: "http://www.fs.fed.us/eng/rsac/" [Summary provided by the USDA.]
in scheme: providers

USDA
type: Concept