GOES-15 Imager
type: Concept
change note: 2013-06-12 15:06:25.0 [mpmorahan] insert AltLabel (id: null text: Geostationary Operational Environmental Satellite 15-Imager language code: en);
change note: 2013-06-12 14:28:05.0 [mpmorahan] Insert Concept add broader relation (GOES-15 Imager [3c56938d-eb2f-4cc1-97ed-d0d0865f679b,105221] - Imaging Spectrometers/Radiometers [944b7691-af37-4fb4-9393-c114e7997829,74845]);
definition: Measures cloud cover, atmospheric radiance, winds, atmospheric stability, rainfall estimates. Used to provide severe storm warnings/ monitoring day and night (type, amount, storm features). Group: Instrument_Details Entry_ID: GOES-15 Imager Group: Instrument_Identification Instrument_Category: Earth Remote Sensing Instruments Instrument_Class: Passive Remote Sensing Instrument_Type: Spectrometers/Radiometers Instrument_Subtype: Imaging Spectrometers/Radiometers Short_Name: GOES-15 Imager Long_Name: Geostationary Operational Environmental Satellite 15-Imager End_Group Group: Associated_Platforms Short_Name: GOES-15 End_Group Group: Spectral_Frequency_Information Wavelength_Keyword: VISIBLE Spectral_Frequency_Coverage_Range: ~0.40 µm - ~0.75 µm End_Group Group: Spectral_Frequency_Information Wavelength_Keyword: NEAR INFRARED Spectral_Frequency_Coverage_Range: ~0.75 µm - ~1.3 µm End_Group Online_Resource: http://www.ospo.noaa.gov/Operations/GOES/index.html Creation_Date: 2013-06-13 Group: Instrument_Logistics Instrument_Start_Date: 2010-03-04 Instrument_Owner: NOAA End_Group End_Group
in scheme: instruments

Imaging Spectrometers/Radiometers
type: Concept