GCI
type: Concept
definition: The Global Commons Institute (GCI) is an independent group concerned with the protection of the global commons. The global commons is the common heritage of all humanity. It comprises those features of the geo-biosphere - such as forests, biodiversity, oceans and global atmosphere.- that in combination form the global climate system GCI was founded in 1990 after the Second World Climate Conference. Since that time GCI has contributed to the work of the UN Framework Convention on Climate Change (UN FCCC) and the Intergovernmental Panel on Climate Change (IPCC). Summary Provided By: http://www.gci.org.uk/
in scheme: providers

CONSORTIA/INSTITUTIONS
type: Concept