SSM
type: Concept
change note: 2019-08-05 11:06:33.0 [tstevens] insert AltLabel (id: null category: primary text: SQUID Superconducting Magnetometers language code: en); insert Definition (id: null text: A SQUID (for superconducting quantum interference device) is a very sensitive magnetometer used to measure extremely subtle magnetic fields, based on superconducting loops containing Josephson junctions. language code: en);
change note: 2019-08-05 11:04:49.0 [tstevens] Insert Concept add broader relation (SSM [3cc96a71-b8c6-4b4e-abd2-585fd7bc00fe,369013] - MAGNETOMETERS [deac2632-5c17-4d15-ae92-c61ebc5a405a,348905]);
definition: A SQUID (for superconducting quantum interference device) is a very sensitive magnetometer used to measure extremely subtle magnetic fields, based on superconducting loops containing Josephson junctions.
in scheme: instruments

MAGNETOMETERS
type: Concept