R/V ONNURI
type: Concept
change note: 2022-02-23 13:48:24.0 [tstevens] insert Definition (id: null text: A Korean Ocean Research and Development Institute (KORDI)'s research vessels. She was built in Bergen, Norway in 1991 by Mjellem & Karlsen Verft AS and designed by Skipsteknisk AS. She has been used to supply Korea's Antarctic research station (King Sejong Station) as well as undertaking oceanographic research in the Pacific Ocean. language code: en);
change note: 2021-11-18 09:26:26.0 [tstevens] Move Concepts delete broader relation (null); add broader relation (R/V ONNURI [3ccb3423-b471-437e-87d0-e964702bd90f,826157] - Surface [59b97a6c-385e-40a2-8422-ecbdb6023c4c,835900]);
change note: 2013-05-24 15:51:13.0 [aaleman] Insert Concept add broader relation (R/V ONNURI [3ccb3423-b471-437e-87d0-e964702bd90f,105161] - SHIPS [82a67b12-e99d-4c90-8a6a-a6f79d4c3c7b,73407]);
definition: A Korean Ocean Research and Development Institute (KORDI)'s research vessels. She was built in Bergen, Norway in 1991 by Mjellem & Karlsen Verft AS and designed by Skipsteknisk AS. She has been used to supply Korea's Antarctic research station (King Sejong Station) as well as undertaking oceanographic research in the Pacific Ocean.
in scheme: platforms

Surface
type: Concept