SUPERDARN
type: Concept
change note: 2022-04-07 08:53:15.0 [tstevens] update AltLabel (Super Dual Auroral Radar Network); update Definition (The Super Dual Auroral Radar Network (SuperDARN) is an international ground-based, high-frequency (HF) radar network for studying the Earth's upper atmosphere, ionosphere, and connection into space.);
definition: The Super Dual Auroral Radar Network (SuperDARN) is an international ground-based, high-frequency (HF) radar network for studying the Earth's upper atmosphere, ionosphere, and connection into space.
in scheme: projects

S - U
type: Concept