Chemical Meters/Analyzers
type: Concept

TSI CPC-3025
type: Concept
change note: 2018-05-23 18:20:55.0 [sritz] Move Concepts add narrower relation (TSI CPC-3025 [3e507cc0-d6a2-4bd5-9598-70956268e9aa,346897] - PICARRO L2130-i Flight Ready Water Vapor Isotopic Analyzer [df90c6d6-4201-4f3a-9792-22395447add6,367623]);
change note: 2018-05-23 18:21:13.0 [sritz] Move Concepts delete narrower relation (null);
change note: 2017-06-28 12:14:33.0 [sritz] insert AltLabel (id: null category: primary text: TSI Condensation Particle Counter 3025 Manufactured by TSI Inc. language code: en); insert Definition (id: null text: TSI's Model 3025A Ultrafine Condensation Particle Counter is a continuous-flow particle counter that detects particles as small as 3 nm in diameter. A sheath-air flow design optimizes this CPC's efficiency for detecting ultrafine particles, for concentrations up to 105 particles/cm3. The 3025A responds quickly to concentration changes. It includes a front-panel display for viewing particle counts or concentration data. An internal microprocessor and built-in serial port simplify data collection and storage. language code: en);
change note: 2017-06-28 12:13:39.0 [sritz] Insert Concept add broader relation (TSI CPC-3025 [3e507cc0-d6a2-4bd5-9598-70956268e9aa,309753] - Chemical Meters/Analyzers [3d25724b-832f-4a61-b0b2-4f2ccecdba94,289589]);
definition: TSI's Model 3025A Ultrafine Condensation Particle Counter is a continuous-flow particle counter that detects particles as small as 3 nm in diameter. A sheath-air flow design optimizes this CPC's efficiency for detecting ultrafine particles, for concentrations up to 105 particles/cm3. The 3025A responds quickly to concentration changes. It includes a front-panel display for viewing particle counts or concentration data. An internal microprocessor and built-in serial port simplify data collection and storage.
in scheme: instruments