USDA/NRCS/CED
type: Concept
definition: The Natural Resources Conservation Service Conservation Engineering performs construction projects related to conservation. This includes irrigation and water management, watershed protection, flood prevention operations, stream restoration, and animal waster management. Website: "http://www.nrcs.usda.gov/technical/ENG/" [Summary provided by the USDA.]
in scheme: providers

USDA
type: Concept