Models
type: Concept

MITgcm
type: Concept
change note: 2019-11-25 13:00:12.0 [mmorahan] insert Definition (id: null text: numerical model designed for study of the atmosphere, ocean, and climate, MITgcm’s flexible non-hydrostatic formulation enables it to efficiently simulate fluid phenomena over a wide range of scales; its adjoint capabilities enable it to be applied to sensitivity questions and to parameter and state estimation problems. By employing fluid equation isomorphisms, a single dynamical kernel can be used to simulate flow of both the atmosphere and ocean. The model is developed to perform efficiently on a wide variety of computational platforms. language code: en);
change note: 2020-06-19 05:04:38.0 [mmorahan] insert AltLabel (id: null category: primary text: Massachusetts Institute of Technology General Circulation Model language code: en);
change note: 2019-11-25 12:58:47.0 [mmorahan] Insert Concept add broader relation (MITgcm [3fd56bd8-0e40-4401-9033-97df9a552001,423563] - Models/Analyses [113ecbc2-ab36-4d58-a96c-a6ce0106e749,405101]);
change note: 2021-11-30 13:32:12.0 [tstevens] Move Concepts delete broader relation (null); add broader relation (MITgcm [3fd56bd8-0e40-4401-9033-97df9a552001,826174] - Models [0a184cdc-c074-4946-90a6-02f03c686341,835911]);
definition: numerical model designed for study of the atmosphere, ocean, and climate, MITgcm’s flexible non-hydrostatic formulation enables it to efficiently simulate fluid phenomena over a wide range of scales; its adjoint capabilities enable it to be applied to sensitivity questions and to parameter and state estimation problems. By employing fluid equation isomorphisms, a single dynamical kernel can be used to simulate flow of both the atmosphere and ocean. The model is developed to perform efficiently on a wide variety of computational platforms.
in scheme: platforms