R/V L'ASTRO
type: Concept
change note: 2022-02-23 13:31:43.0 [tstevens] insert Definition (id: null text: A French icebreaker that is used to bring personnel and supplies to the Dumont d'Urville Station in Antarctica. language code: en);
change note: 2021-11-18 09:28:12.0 [tstevens] Move Concepts delete broader relation (null); add broader relation (R/V L'ASTRO [40e85d85-0619-48ab-83ab-dc7371d1eeaf,826177] - Surface [59b97a6c-385e-40a2-8422-ecbdb6023c4c,835900]);
definition: A French icebreaker that is used to bring personnel and supplies to the Dumont d'Urville Station in Antarctica.
in scheme: platforms

Surface
type: Concept