WATER VAPOR TRANSPORT INDEX
type: Concept
change note: 2017-04-21 13:35:32.0 [sritz] update Definition (Gary J. Jedloveca, Jeffrey A. Lernerb, and Robert J. Atkinson, 2000, http://dx.doi.org/10.1175/1520-0450(2000)039<0015:ASDUTW>2.0.CO;2);
change note: 2017-04-21 13:35:11.0 [sritz] insert Definition (id: null text: Represents the magnitude of the two-dimensional transport of water vapor in the upper troposphere. language code: en);
change note: 2017-04-20 14:22:34.0 [sritz] Insert Concept add broader relation (WATER VAPOR TRANSPORT INDEX [425486f4-7b04-4b77-af40-563fe6ed4167,278841] - WATER VAPOR INDICES [4f58cf68-0d44-424a-88af-65c3edfd0945,278817]);
definition: Represents the magnitude of the two-dimensional transport of water vapor in the upper troposphere.
in scheme: sciencekeywords

WATER VAPOR INDICES
type: Concept