WATER DEPTH
type: Concept
change note: 2016-04-04 09:35:08.0 [gee-cee] update Definition (The measurement of the vertical distance from the surface of a body of water to the floor.); update Definition (Dictionary of Earth Science, 5th ed. 1997. Sybil Parker, ed. in chief. McGraw-Hill. );
change note: 2016-03-31 08:14:30.0 [gee-cee] Move Concepts delete broader relation (null); add broader relation (WATER DEPTH [42aa1fa1-56a9-4e96-8063-077bd7ba88d8,84943] - SURFACE WATER PROCESSES/MEASUREMENTS [9d86cd70-062a-4c39-b3f3-226abebc07f7,158723]);
definition: The measurement of the vertical distance from the surface of a body of water to the floor.
in scheme: sciencekeywords

SURFACE WATER PROCESSES/MEASUREMENTS
type: Concept