Earth Observation Satellites
type: Concept

ICEYE
type: Concept
change note: 2020-10-06 08:17:57.0 [mmorahan] insert AltLabel (id: null category: primary text: ICEYE language code: en);
change note: 2019-04-26 12:06:39.0 [mmorahan] insert WeightedRelation (id: null related concept uuid: 285c90fb-0b3f-487f-a094-40d6dea7948e relationship type: null relationship value: null generated by: null);
change note: 2019-04-26 11:57:42.0 [mmorahan] Insert Concept add broader relation (ICEYE [42c6ff80-849b-4ef5-b6ff-fd9416b8cf33,368717] - Earth Observation Satellites [3466eed1-2fbb-49bf-ab0b-dc08731d502b,344761]);
change note: 2019-04-26 12:02:09.0 [mmorahan] insert Definition (id: null text: ICEYE's overall mission is to enable better decision making for everyone by providing timely and reliable Earth observation data. To achieve that goal, the company is developing its own synthetic-aperture radar (SAR) sensor technologies suitable for satellites under 100kg in weight. ICEYE is building a constellation of 18 SAR satellite by end of 2020 and that will enable a 3 hour on average revisit rate around the globe. language code: en);
definition: ICEYE's overall mission is to enable better decision making for everyone by providing timely and reliable Earth observation data. To achieve that goal, the company is developing its own synthetic-aperture radar (SAR) sensor technologies suitable for satellites under 100kg in weight. ICEYE is building a constellation of 18 SAR satellite by end of 2020 and that will enable a 3 hour on average revisit rate around the globe.
in scheme: platforms