BIRDS
type: Concept

LOONS
type: Concept
change note: 2017-03-15 09:21:18.0 [mgenazzi] Definition added insert Definition (id: null text: Phylum Chordata. Class Aves. Order Gaviiformes. Loons are large diving aquatic birds with rounded heads, dagger-like bills and webbing between their toes. language code: en);
definition: Phylum Chordata. Class Aves. Order Gaviiformes. Loons are large diving aquatic birds with rounded heads, dagger-like bills and webbing between their toes.
in scheme: sciencekeywords