Chemical Meters/Analyzers
type: Concept

OAMI
type: Concept
definition: Oxidants Automatic Measuring Instrument (OAMI) is a instrument for measuring sulfur dioxide and oxides of nitrogen; used for monitoring air pollution.
in scheme: instruments