VELOCITY AZIMUTH DISPLAY VERTICAL WIND PROFILES
type: Concept
change note: 2017-04-21 13:10:47.0 [tstevens] update Definition (One of the software algorithms within the WSR-88D (weather radar) calculates wind direction and speed at various atmospheric levels. The resulting product is called the Velocity Azimuth Display (VAD) Wind Profile (VWP).);
change note: 2017-04-21 11:37:57.0 [tstevens] insert Definition (id: null text: One of the software algorithms within the WSR-88D (weather radar) calculates wind direction and speed at various atmospheric levels. The resulting product is called the Velocity Azimuth Display (VAD) Wind Profile (VWP) language code: en);
change note: 2017-04-20 15:04:04.0 [sritz] Insert Concept add broader relation (VELOCITY AZIMUTH DISPLAY VERTICAL WIND PROFILES [4478e3ea-ac49-4ea3-bcb8-e6b4e2190266,278889] - WIND PROFILES [dcc6cbbf-23a0-4ae7-bfbd-6207d35c741f,83373]);
definition: One of the software algorithms within the WSR-88D (weather radar) calculates wind direction and speed at various atmospheric levels. The resulting product is called the Velocity Azimuth Display (VAD) Wind Profile (VWP).
in scheme: sciencekeywords

WIND PROFILES
type: Concept