DOC/NOAA/NWS/NCEP/NCO
type: Concept
alternative label: NCEP Central Operations, National Centers for Environmental Prediction, National Weather Service, NOAA, U.S. Department of Commerce
change note: 2016-07-05 16:53:01.0 [saritz] Insert Concept add broader relation (DOC/NOAA/NWS/NCEP/NCO [4512f35e-0148-447a-9561-fc4146a74e18,217809] - NOAA [c9003d36-020d-4e86-995a-498945576c23,189469]);
change note: 2016-07-05 16:54:06.0 [saritz] insert AltLabel (id: null text: NCEP Central Operations, National Centers for Environmental Prediction, National Weather Service, NOAA, U.S. Department of Commerce language code: en);
change note: 2016-07-05 16:54:43.0 [saritz] insert Definition (id: null text: NCO MISSION • Execute the NCEP operational model suite - Create climate, weather, ocean, space and environmental hazard products • Manage improvements to the NCEP model suite - Support the research, development, and transition of new or enhanced models to operations • Develop meteorological software - Used by the NCEP Centers to create forecaster generated products • Manage the flow of data and products - To and from the NCEP centers, partners, and customers language code: en);
definition: NCO MISSION • Execute the NCEP operational model suite - Create climate, weather, ocean, space and environmental hazard products • Manage improvements to the NCEP model suite - Support the research, development, and transition of new or enhanced models to operations • Develop meteorological software - Used by the NCEP Centers to create forecaster generated products • Manage the flow of data and products - To and from the NCEP centers, partners, and customers
in scheme: providers

NOAA
type: Concept