UC-LA/SMBO
type: Concept
definition: The Santa Monica Bay Observatory mooring is located at 33° 56'N, 118°43'W inside Santa Monica Bay at a water depth of about 450 m. Data are telemetered back to UCLA daily via radio and made available to the public through our LAS server. Summary Provided By: http://quercus.igpp.ucla.edu/smbo/smbo_mooring.html
in scheme: providers

ACADEMIC
type: Concept