Permanent Land Sites
type: Concept

PMS
type: Concept
change note: 2022-02-08 13:07:07.0 [tstevens] update Definition (Permafrost Monitoring Stations measure the underlying state of permafrost. These fully automated stations continuously monitor: -Air temperature -Snow Depth -Solar radiation -Shallow permafrost temperature (at several depths));
change note: 2021-11-17 14:11:27.0 [tstevens] Move Concepts delete broader relation (null); add broader relation (PMS [465b92cd-6189-4a04-8ee7-484a1da7722f,826206] - Permanent Land Sites [0ec10fd9-492c-498a-b6d8-e2840cc3643b,835887]);
definition: Permafrost Monitoring Stations measure the underlying state of permafrost. These fully automated stations continuously monitor: -Air temperature -Snow Depth -Solar radiation -Shallow permafrost temperature (at several depths)
in scheme: platforms