HEAT FLUX
type: Concept
definition: Heat flux is the amount of heat that is transferred across a surface of unit area in a unit of time. Also refers to latent and sensible heat fluxes in the atmosphere and between the Earth's surface and atmosphere.
in scheme: sciencekeywords

ATMOSPHERIC RADIATION
type: Concept