Corers
type: Concept

CORING DEVICES
type: Concept
change note: 2021-08-04 18:09:40.0 [sritz] insert AltLabel (id: null category: primary text: CORING DEVICES language code: en);
definition: Coring devices essentially drills a hole in the ice sheet and pulls out the ice core.
in scheme: instruments