Models
type: Concept

ECMWFIFS
type: Concept
change note: 2015-08-10 14:42:01.0 [epneff] Added long name insert AltLabel (id: null text: ECMWF Integrated Forecast System language code: en);
change note: 2015-08-10 14:41:36.0 [epneff] Insert Concept add broader relation (ECMWFIFS [47ee8305-57b9-4df1-84ce-f563df48cf69,158215] - Models/Analyses [113ecbc2-ab36-4d58-a96c-a6ce0106e749,143215]);
change note: 2022-03-11 07:44:40.0 [tstevens] insert Definition (id: null text: The Integrated Forecasting System (IFS) is a global numerical weather prediction system jointly developed and maintained by the European Centre for Medium-Range Weather Forecasts (ECMWF) based in Reading, England, and Météo-France based in Toulouse. language code: en);
change note: 2021-11-30 13:34:23.0 [tstevens] Move Concepts delete broader relation (null); add broader relation (ECMWFIFS [47ee8305-57b9-4df1-84ce-f563df48cf69,826210] - Models [0a184cdc-c074-4946-90a6-02f03c686341,835911]);
definition: The Integrated Forecasting System (IFS) is a global numerical weather prediction system jointly developed and maintained by the European Centre for Medium-Range Weather Forecasts (ECMWF) based in Reading, England, and Météo-France based in Toulouse.
in scheme: platforms