Deimos-2
type: Concept
change note: 2020-10-06 08:04:23.0 [mmorahan] insert AltLabel (id: null category: primary text: Deimos-2 Minisatellite Mission language code: en);
change note: 2018-07-04 09:17:45.0 [mmorahan] insert WeightedRelation (id: null related concept uuid: d7fbb6b1-1925-4a32-b399-c578435db47c relationship type: null relationship value: null generated by: null);
change note: 2018-06-12 05:24:50.0 [mmorahan] insert Definition (id: null text: Deimos-2 is a very-high resolution (75cm pan-sharpened) multispectral optical satellite, fully owned and operated by Deimos Imaging, an UrtheCast company. The Deimos-2 end-to-end system has been designed to provide a costeffective yet highly responsive service to customers worldwide. Deimos-2 is the second satellite of the Deimos Earth Observation system, following Deimos-1, which was launched in 2009 and provides mid-resolution, very-wide-swath imagery. Deimos-2 has been launched on 19 June 2014, with a mission lifetime of at least seven years. It operates from a Sun-synchronous orbit at a mean altitude of 620 km, with a local time of ascending node (LTAN) of 10h30, which allows an average revisit time of two days worldwide (one day at mid-latitudes). The spacecraft design is based on an agile platform for fast and precise off-nadir imaging (up to 30º over nominal scenarios and up to 45º in emergency cases), and it carries a push-broom very-high resolution camera with 5 spectral channels (1 panchromatic, 4 multispectral). language code: en);
change note: 2018-06-12 05:18:45.0 [mmorahan] Insert Concept add broader relation (Deimos-2 [48e0f5f2-08fb-4739-8c5f-f53e24003f8c,367667] - Deimos [f122ab59-266b-4be9-99ad-4c2172bcf97c,367663]);
definition: Deimos-2 is a very-high resolution (75cm pan-sharpened) multispectral optical satellite, fully owned and operated by Deimos Imaging, an UrtheCast company. The Deimos-2 end-to-end system has been designed to provide a costeffective yet highly responsive service to customers worldwide. Deimos-2 is the second satellite of the Deimos Earth Observation system, following Deimos-1, which was launched in 2009 and provides mid-resolution, very-wide-swath imagery. Deimos-2 has been launched on 19 June 2014, with a mission lifetime of at least seven years. It operates from a Sun-synchronous orbit at a mean altitude of 620 km, with a local time of ascending node (LTAN) of 10h30, which allows an average revisit time of two days worldwide (one day at mid-latitudes). The spacecraft design is based on an agile platform for fast and precise off-nadir imaging (up to 30º over nominal scenarios and up to 45º in emergency cases), and it carries a push-broom very-high resolution camera with 5 spectral channels (1 panchromatic, 4 multispectral).
in scheme: platforms

Deimos
type: Concept