Permanent Land Sites
type: Concept

GROUND STATIONS
type: Concept
alternative label: GROUND STATION
change note: 2021-07-23 16:40:25.0 [sritz] insert AltLabel (id: null category: primary text: GROUND STATIONS language code: en);
change note: 2021-11-17 14:01:55.0 [tstevens] Move Concepts delete broader relation (null); add broader relation (GROUND STATIONS [491d3fcc-c097-4357-b1cf-39ccf3592347,826216] - Permanent Land Sites [0ec10fd9-492c-498a-b6d8-e2840cc3643b,835887]);
change note: 2022-02-08 12:51:12.0 [tstevens] update Definition (A precise point along the ground or surface where measurements or surveys are made. Group: Platform_Details Entry_ID: GROUND STATIONS Group: Platform_Identification Platform_Category: In Situ Land-based Platforms Short_Name: GROUND STATIONS End_Group End_Group); update Definition (The American Heritage Dictionary of the English Language, Fourth Edition Copyright 2000 by Houghton Mifflin Company);
change note: 2016-06-09 14:42:25.0 [epneff] added altLabel insert AltLabel (id: null text: GROUND STATION language code: en);
definition: A precise point along the ground or surface where measurements or surveys are made. Group: Platform_Details Entry_ID: GROUND STATIONS Group: Platform_Identification Platform_Category: In Situ Land-based Platforms Short_Name: GROUND STATIONS End_Group End_Group
in scheme: platforms