ISD
type: Concept
definition: The Global Invasive Species Database was developed by the IUCN/SSC Invasive Species Specialist Group (ISSG) as part of the global initiative on invasive species led by the Global Invasive Species Programme (GISP). It provides global information on invasive alien species to agencies, resource managers, decision-makers, and interested individuals. The database focuses on invasive species that threaten biodiversity and covers all taxonomic groups from micro-organisms to animals and plants. Species information is supplied by expert contributors from around the world and includes; species' biology, ecology, native and alien range, references, contacts, links and images. For more information, lik to "http://www.issg.org/database/welcome/" [Summary provided by IUCN/SSC]
in scheme: projects

G - I
type: Concept