CGIAR/IWMI
type: Concept
definition: The International Water Management Institute (IWMI) is a non-profit scientific research organization specializing in water use in agriculture and integrated management of water and land resources. IWMI works with partners in the South to develop tools and methods to help these countries eradicate poverty and ensure food security through more effective management of their water and land resources. [Summary provided by IWMI]
in scheme: providers

MULTINATIONAL ORGANIZATIONS
type: Concept