MARICULTURE PRODUCTION
type: Concept
change note: 2012-07-11 08:21:07.0 [tbs1979] insert Definition (id: null text: The production and cultivation of marine organisms for food and other products in the open ocean, an enclosed section of the ocean, or in tanks, ponds or raceways which are filled with seawater. language code: en);
change note: 2012-06-26 15:36:51.0 [tbs1979] Insert Concept add broader relation (MARICULTURE PRODUCTION [49da5018-59ec-4a60-9cb9-614ea6266ced,40103] - ECONOMIC RESOURCES [cdbe5ef5-408d-489d-b6ff-4482ce4a99c7,21249]);
definition: The production and cultivation of marine organisms for food and other products in the open ocean, an enclosed section of the ocean, or in tanks, ponds or raceways which are filled with seawater.
in scheme: sciencekeywords

ECONOMIC RESOURCES
type: Concept