SMMR
type: Concept
change note: 2015-07-20 17:12:46.0 [saritz] insert Definition (id: null text: The Prabhakara Scanning Multichannel Microwave Radiometer (SMMR) atmospheric liquid water (ALW) and integrated atmospheric water vapor (IWV) data sets were generated by Dr. Prabhakara Cuddapah at the Goddard Space Flight Center using SMMR antenna temperatures. language code: en);
change note: 2020-08-12 09:32:56.0 [tstevens] insert AltLabel (id: null category: primary text: Prabhakara Scanning Multichannel Microwave Radiometer language code: en); update Definition (https://asdc.larc.nasa.gov/project/SMMR);
change note: 2015-07-20 17:11:28.0 [saritz] Insert Concept add broader relation (SMMR [4a2d4e54-1e39-46d6-aafd-a3f685ed4f85,158103] - S - U [4eb1894b-35b4-406b-8864-944a42bc7702,148357]);
definition: The Prabhakara Scanning Multichannel Microwave Radiometer (SMMR) atmospheric liquid water (ALW) and integrated atmospheric water vapor (IWV) data sets were generated by Dr. Prabhakara Cuddapah at the Goddard Space Flight Center using SMMR antenna temperatures.
in scheme: projects

S - U
type: Concept