COMMERCIAL
type: Concept

CWAB
type: Concept
definition: ChartWrite AB develops GIS and mapping software with focus on soil mapping and land use management. AgriMapper is a new, user friendly and cost effective Win95 software for land management with raster based soil mapping. chartwrite.com
in scheme: providers