USDA/CSREES/NCCES/NCSU
type: Concept
definition: The North Carolina Cooperative Extension is an educational partnership helping people put research-based knowledge to work for economic prosperity, environmental stewardship and an improved quality of life. Website: "http://www.ces.ncsu.edu/" [Summary provided by North Carolina State University.]
in scheme: providers

USDA
type: Concept