GEOMAGNETIC FORECASTS
type: Concept

GEOMAGNETIC STORM CATEGORY
type: Concept
change note: 2013-03-11 14:28:47.0 [tbs1979] insert Definition (id: null text: A category or scale that describe the environmental disturbances for three event types: geomagnetic storms, solar radiation storms, and radio blackouts. The scales have numbered levels, analogous to hurricanes, tornadoes, and earthquakes that convey severity. They list possible effects at each level. They also show how often such events happen, and give a measure of the intensity of the physical causes. language code: en);
change note: 2013-02-18 09:51:53.0 [tbs1979] Insert Concept add broader relation (GEOMAGNETIC STORM CATEGORY [4b7decec-e378-4824-aecf-9fe509392efd,82401] - GEOMAGNETIC FORECASTS [02290e22-24ae-40f6-96f1-0c6c76a145af,63913]);
definition: A category or scale that describe the environmental disturbances for three event types: geomagnetic storms, solar radiation storms, and radio blackouts. The scales have numbered levels, analogous to hurricanes, tornadoes, and earthquakes that convey severity. They list possible effects at each level. They also show how often such events happen, and give a measure of the intensity of the physical causes.
in scheme: sciencekeywords