EARTHQUAKE MAGNITUDE/INTENSITY
type: Concept
change note: 2013-04-02 09:04:23.0 [tbs1979] update Definition (The measure of the amount of energy released during an earthquake.); update Definition (Leonard Geophysical Observatory);
change note: 2013-03-07 09:29:21.0 [tbs1979] update PrefLabel (EARTHQUAKE MAGNITUDE/INTENSITY);
definition: The measure of the amount of energy released during an earthquake.
in scheme: sciencekeywords

EARTHQUAKES
type: Concept