COMMERCIAL
type: Concept

SITEX
type: Concept
definition: SiteX is mainly specialized in web site development and in digital design. The goad of the company is to create and implement programs for middle-size companies, with high impact on a specific target. Website: http://www.sitex.ro/
in scheme: providers