MICROBAROGRAPHS
type: Concept
definition: MICROBAROGRAPHS are aneroid barographs designed to record atmospheric pressure variations of very small magnitude.
in scheme: instruments

Pressure/Height Meters
type: Concept