WATER ION CONCENTRATIONS
type: Concept
change note: 2018-03-14 09:32:07.0 [tstevens] update PrefLabel (WATER ION CONCENTRATIONS);
change note: 2018-03-07 12:40:06.0 [tstevens] update Definition (The concentration of ions in water. Ions are positively or negatively charged atom or group of atoms.); update Definition (Water Resources Glossaries from the USGS);
change note: 2018-03-07 08:26:45.0 [tstevens] Move Concepts delete broader relation (null); add broader relation (WATER ION CONCENTRATION [4cc8def9-a825-4ede-9e34-4e11cf89488d,86501] - WATER CHARACTERISTICS [f7e97dc3-1181-41b5-8b90-946eb2504110,310633]);
definition: The concentration of ions in water. Ions are positively or negatively charged atom or group of atoms.
in scheme: sciencekeywords

WATER CHARACTERISTICS
type: Concept