VALLEY BREEZES
type: Concept
change note: 2017-04-21 12:35:19.0 [tstevens] insert Definition (id: null text: (Or valley breeze.) A wind that ascends a mountain valley (upvalley wind) during the day; the daytime component of a mountain–valley wind system. language code: en);
change note: 2017-04-20 15:17:54.0 [sritz] Insert Concept add broader relation (VALLEY BREEZES [4d005bfc-597b-4a99-971f-21d3d44b7b91,278917] - OROGRAPHIC WINDS [a1df1d50-dd2b-4944-bda5-0cf1127e2f49,278903]);
definition: (Or valley breeze.) A wind that ascends a mountain valley (upvalley wind) during the day; the daytime component of a mountain–valley wind system.
in scheme: sciencekeywords

OROGRAPHIC WINDS
type: Concept