NRSC-UOPS
type: Concept
change note: 2016-04-06 16:43:26.0 [mpmorahan] insert AltLabel (id: null text: National Remote Sensing Centre - User Order Processing System language code: en); insert Definition (id: null text: National Remote Sensing Centre (NRSC) - User Order Processing System (UOPS) language code: en);
change note: 2016-04-06 16:41:23.0 [mpmorahan] Insert Concept add broader relation (NRSC-UOPS [4d4f0734-dad0-4bb4-a4e2-c141eaee422f,158893] - M - O [a31c2828-9b6d-44e9-b6ad-7ae81030f322,149461]);
definition: National Remote Sensing Centre (NRSC) - User Order Processing System (UOPS)
in scheme: projects

M - O
type: Concept