LEDAPS
type: Concept
change note: 2013-04-11 13:36:05.0 [tbs1979] Insert Concept add broader relation (LEDAPS [4d703a80-e5c6-4476-86f8-81e778d1197c,83267] - J - L [996e8a4b-e690-4a9c-afcf-205fff95b38b,77535]);
definition: Landsat Ecosystem Disturbance Adaptive Processing System (LEDAPS) is a NASA-funded project to map North American forest disturbance since 1975 from the Landsat and ASTER satellite data. LEDAPS also produces maps of surface reflectance derived from Landsat imagery to support a variety of ecosystem studies. LEDAPS is part of NASA's contribution to the North American Carbon Program (NACP), a component of the USGCRP Carbon Cycle Science Program. http://ledaps.nascom.nasa.gov/
in scheme: projects

J - L
type: Concept