TREATY AGREEMENTS/RESULTS
type: Concept
change note: 2012-06-29 14:31:45.0 [tbs1979] insert Definition (id: null text: A written agreement between two states or sovereigns and the subsequent results of those agreements. language code: en);
change note: 2012-06-27 13:47:31.0 [tbs1979] Insert Concept add broader relation (TREATY AGREEMENTS/RESULTS [4dad174d-9419-4634-84f0-7eeb1d517241,40203] - ENVIRONMENTAL GOVERNANCE/MANAGEMENT [d81b77be-0177-4e26-942c-aa911239482d,40199]);
definition: A written agreement between two states or sovereigns and the subsequent results of those agreements.
in scheme: sciencekeywords

ENVIRONMENTAL GOVERNANCE/MANAGEMENT
type: Concept