WAVE SETUP
type: Concept
change note: 2017-12-28 11:32:39.0 [sritz] Insert Concept add broader relation (WAVE SETUP [4dd520ea-30fc-416d-b98c-340fd23431d3,310505] - OCEAN WAVES [a04804d5-1064-48fd-a7a7-8da8e10399e1,84567]);
definition: Wave setup is the increase in mean water level due to the presence of breaking waves.
in scheme: sciencekeywords

OCEAN WAVES
type: Concept