Earth Observation Satellites
type: Concept

SME
type: Concept
change note: 2021-11-18 13:46:59.0 [tstevens] Move Concepts delete broader relation (null); add broader relation (SME [4e357ecc-78bd-4da7-b28a-4b34f61f8587,826228] - Earth Observation Satellites [3466eed1-2fbb-49bf-ab0b-dc08731d502b,826121]);
change note: 2021-11-18 12:42:54.0 [tstevens] Move Concepts delete broader relation (null); add broader relation (SME [4e357ecc-78bd-4da7-b28a-4b34f61f8587,826228] - Space-based Platforms [b39a69b4-c3b9-4a94-b296-bbbbe5e4c847,835875]);
definition: The Solar Mesosphere Explorer (SME) mission objective was primarily to investigate the processes that create and destroy ozone in the Earth's mesosphere and upper stratosphere. Some specific goals were (1) to determine the nature and magnitude of changes in mesospheric ozone densities resulting from changes in the solar ultraviolet flux; (2) to determine the interrelationship between solar flux, ozone, and the temperature of the upper stratosphere and mesosphere; (3) to determine the interrelationship between ozone and water vapor; and (4) to determine the interrelationship between nitrogen dioxide and ozone. The satellite experiment complement consisted of a solar ultraviolet spectrometer, an ultraviolet ozone spectrometer, an infrared radiometer, a 1.27-micrometer spectrometer, and a nitrogen dioxide spectrometer. In addition, a solar proton alarm detector was carried on board to measure the integrated solar flux in the range 30 to 500 MeV. Spin stabilized at 5 rpm, the satellite moved in a 3 a.m. to 3 p.m. sun-synchronous orbit. The spacecraft body was a cylinder approximately 1.7 by 1.25 m and consisted of two major modules: the observatory module that housed the scientific instruments, and the spacecraft bus. The spin axis was oriented normal to the orbital plane. The command system was capable of executing commands in real time or from stored program control. Power was supplied by a solar cell array. The telemetry system was used either in a real-time or in a tape-recorder mode. Further details and some measurement results are written in C. A. Barth et al., 'Solar mesosphere explorer: scientific objectives and results,' Geophys. Res. Lett., v. 10, no. 4, p. 237, 1983. All instruments on board the SME were turned off in December 1988 because of energy considerations. - Auxiliary Information - Launch Date and Time : 1981-10-06 11:27:00 Epoch Date and Time : 1981-10-16 Apogee (km or AU): 551. Perigee (km or AU): 535. Inclination (degree) : 97.5 Orbit Type : Geoce…
in scheme: platforms