COASTAL LANDFORMS
type: Concept

SHORELINES
type: Concept
change note: 2013-08-20 09:23:39.0 [tbs1979] insert Definition (id: null text: The fringe of land at the edge of a large body of water, such as an ocean, sea, or lake. In Physical Oceanography a shore is the wider fringe that is geologically modified by the action of the body of water past and present, while the beach is at the edge of the shore, representing the intertidal zone where there is one. is the fringe of land at the edge of a large body of water, such as an ocean, sea, or lake. In Physical Oceanography a shore is the wider fringe that is geologically modified by the action of the body of water past and present, while the beach is at the edge of the shore, representing the intertidal zone where there is one. language code: en);
change note: 2013-08-06 08:18:37.0 [tbs1979] Insert Concept add broader relation (SHORELINES [4e5cf935-cf17-4947-bd1f-6816a855953a,105545] - COASTAL LANDFORMS [0cff6e4b-e42a-4565-89ff-350adf41ed69,105283]);
definition: The fringe of land at the edge of a large body of water, such as an ocean, sea, or lake. In Physical Oceanography a shore is the wider fringe that is geologically modified by the action of the body of water past and present, while the beach is at the edge of the shore, representing the intertidal zone where there is one. is the fringe of land at the edge of a large body of water, such as an ocean, sea, or lake. In Physical Oceanography a shore is the wider fringe that is geologically modified by the action of the body of water past and present, while the beach is at the edge of the shore, representing the intertidal zone where there is one.
in scheme: sciencekeywords