EPIC
type: Concept
change note: 2017-06-07 10:20:36.0 [sritz] insert AltLabel (id: null text: Enhanced Polychromatic Imaging Camera language code: en); insert Definition (id: null text: DSCOVR Mission's EPIC Instrument - Earth Polychromatic Imaging Camera EPIC instrument views the entire sunlit face of the Earth from sunrise to sunset in 10 narrowband channels, from ultraviolet to near infrared. These measurements can be used to determine ozone, aerosols, cloud heights, dust, volcanic ash. Credit: NASA / DSCOVR: For more photos from DSCOVR, visit: https://www.flickr.com/photos/nasa_goddard/sets/72157647125358753/ For more information about DSCOVR, visit: http://www.nesdis.noaa.gov/DSCOVR/ language code: en);
change note: 2018-06-25 12:28:32.0 [sritz] update AltLabel (Earth Polychromatic Imaging Camera);
change note: 2017-06-07 10:18:57.0 [sritz] Insert Concept add broader relation (EPIC [4ee9c6ac-88c3-4b1e-b269-1736ac220955,309637] - Cameras [d322ae9d-bde0-448f-948d-777aef096eb6,291371]);
definition: DSCOVR Mission's EPIC Instrument - Earth Polychromatic Imaging Camera EPIC instrument views the entire sunlit face of the Earth from sunrise to sunset in 10 narrowband channels, from ultraviolet to near infrared. These measurements can be used to determine ozone, aerosols, cloud heights, dust, volcanic ash. Credit: NASA / DSCOVR: For more photos from DSCOVR, visit: https://www.flickr.com/photos/nasa_goddard/sets/72157647125358753/ For more information about DSCOVR, visit: http://www.nesdis.noaa.gov/DSCOVR/
in scheme: instruments

Cameras
type: Concept