S - U
type: Concept

TRACER-AQ
type: Concept
change note: 2021-09-20 15:34:34.0 [tstevens] insert AltLabel (id: null category: primary text: Tracking Aerosol Convection ExpeRiment – Air Quality language code: en); insert Definition (id: null text: Tracking Aerosol Convection interactions ExpeRiment (TRACER) is a Department of Energy (DOE) Atmospheric Radiation Measurement (ARM) user facility led campaign that will take place from June 2021-2022 (with intensive operations occurring from June through September 2021) to study the impact of aerosols on microphysical processes within convective clouds in the region near Houston, Texas (see DOE/TRACER Science Plan). The Houston region commonly has isolated convection in the presence of variable aerosol environments with measurements strategically placed to capture urban, rural, and marine driven aerosol conditions. language code: en);
change note: 2021-09-20 15:32:06.0 [tstevens] Insert Concept add broader relation (TRACER-AQ [4f9f5ca4-24c0-49a6-950f-991e0ee827bf,749511] - S - U [4eb1894b-35b4-406b-8864-944a42bc7702,743116]);
definition: Tracking Aerosol Convection interactions ExpeRiment (TRACER) is a Department of Energy (DOE) Atmospheric Radiation Measurement (ARM) user facility led campaign that will take place from June 2021-2022 (with intensive operations occurring from June through September 2021) to study the impact of aerosols on microphysical processes within convective clouds in the region near Houston, Texas (see DOE/TRACER Science Plan). The Houston region commonly has isolated convection in the presence of variable aerosol environments with measurements strategically placed to capture urban, rural, and marine driven aerosol conditions.
in scheme: projects